id,sex,gpa,bweight,blength,earlyret,unemp_42,unemp_43,unemp_44,unemp_45,parmental,parcrim,pardeath,educ,marstat40,bestfriends,cognitive,bullied,cvd,income,cvd_date_str,marstat30,marstat30new,skipped,weight,height,bmi,children,siblings,nochildren
1,0,1.9,41,48,0,0,0,0,0,0,0,0,1,2,,100,,0,140000,,UM,3,,,,,0,0,1
2,1,3,,,1,0,0,0,0,0,0,0,1,2,3,104,0,0,,,UM,3,1,76,1.76,24.535124,1,8,0
3,0,,35,45,0,0,0,0,0,0,0,0,2,2,4,104,0,0,170000,,UM,3,1,63,1.85,18.407597,0,3,1
4,1,,37,49,1,0,0,0,0,0,0,0,2,2,3,104,0,0,,,UM,3,1,,,,0,1,1
5,0,2.2,38,48,0,0,60,0,365,0,0,0,1,2,4,104,0,1,120000,20190311,UM,3,2,79,1.74,26.093275,0,8,1
6,0,2,30,43,0,0,0,0,0,1,0,1,2,3,,104,,0,160000,,M,2,2,,,,3,1,0
7,1,2.5,18,38,,0,0,0,,1,0,0,1,2,1,108,1,1,,20120717,UM,3,1,65,1.61,25.076193,0,1,1
8,1,2.8,41,47,0,0,0,320,0,0,1,0,2,1,1,112,1,0,160000,,M,2,1,58,1.7,20.069202,0,3,1
9,1,1.8,30,43,,,,,,0,0,0,1,,1,112,1,0,,,UM,3,1,52,1.65,19.100092,,5,
10,0,3.4000001,20,40,0,0,0,116,0,0,0,0,1,1,,100,,0,110000,,M,2,2,,,,0,4,1
11,1,2.4000001,37,42,1,0,0,63,0,0,0,0,1,2,3,100,0,0,150000,,UM,3,1,62,1.54,26.142691,1,2,0
12,1,3.2,,,0,0,0,0,0,0,0,0,2,2,1,104,1,0,180000,,UM,3,1,60,1.58,24.034609,0,4,1
13,1,2.7,35,43,,,,,,0,1,0,,,1,104,1,0,,,,,1,37,1.73,12.362591,,1,
14,0,2.4000001,35,49,0,306,0,117,0,1,0,0,1,2,,104,,0,,,UM,3,3,,,,0,3,1
15,1,3.0999999,29,42,0,0,0,0,0,0,0,0,1,3,3,104,0,0,160000,,D,1,1,62,1.7,21.453285,0,3,1
16,0,1.7,33,45,0,0,0,0,0,0,0,0,1,2,,104,,0,100000,,UM,3,1,80,1.85,23.374725,0,1,1
17,1,2.5,33,46,1,0,0,0,0,0,0,0,1,2,1,108,1,0,,,UM,3,1,70,1.74,23.120623,0,1,1
18,0,1,,,,0,0,,,1,0,0,1,3,,108,,0,,,D,1,2,,,,0,5,1
19,0,2.5999999,27,42,0,0,0,0,0,0,0,0,,3,,108,,0,120000,,M,2,2,,,,4,3,0
20,0,2.4000001,32,44,1,0,0,0,0,0,0,1,1,2,2,108,0,1,,20121205,UM,3,1,65,1.79,20.286509,0,1,1
21,0,2,31,42,0,0,0,0,0,1,0,0,1,1,3,108,0,0,180000,,M,2,1,75,1.72,25.35154,0,6,1
22,1,2.8,41,46,0,0,0,0,0,0,0,0,1,2,3,108,0,0,120000,,UM,3,1,60,1.65,22.038568,3,1,0
23,0,3,34,47,0,0,0,0,0,1,0,0,1,2,3,108,0,0,190000,,UM,3,1,75,1.75,24.489796,0,5,1
24,0,3.0999999,,,0,77,0,0,0,0,0,0,2,2,2,108,0,0,160000,,UM,3,2,94,1.8099999,28.692656,2,1,0
25,1,2.9000001,41,46,0,0,0,0,0,0,0,0,2,1,2,112,0,0,110000,,M,2,1,68,1.77,21.70513,5,2,0
26,1,3.0999999,34,44,0,0,0,0,0,0,0,1,2,3,3,112,0,1,120000,20180908,M,2,2,60,1.65,22.038568,4,4,0
27,1,2,34,46,0,0,0,0,0,0,0,0,1,4,1,112,1,0,,,W,4,1,68,1.62,25.910685,3,1,0
28,1,2.5999999,,,0,0,0,0,0,0,0,0,1,3,1,112,0,0,150000,,D,1,1,56,1.6900001,19.607155,0,1,1
29,0,3.4000001,38,49,1,0,0,0,0,0,0,1,1,2,,112,,1,,20140126,UM,3,2,,,,1,3,0
30,1,2.2,21,38,0,0,0,0,0,0,0,0,3,1,1,112,1,0,120000,,M,2,1,65,1.67,23.306681,4,1,0
31,1,2.4000001,35,46,,,,,,1,0,1,,,3,112,0,,,,,,1,67,1.59,26.502115,,2,
32,0,1.3,21,39,,,,,,0,0,0,1,,,116,,1,,20130527,UM,3,2,,,,,0,
33,0,2,39,46,0,0,0,0,21,0,0,0,1,2,,116,,0,190000,,UM,3,1,72,1.77,22.981903,0,1,1
34,1,3.5,38,47,1,0,0,0,0,0,0,0,3,3,1,116,1,0,190000,,D,1,2,55,1.67,19.721039,3,3,0
35,0,3,,,1,0,0,0,0,0,0,1,,3,,116,,0,,,M,2,3,,,,0,1,1
36,0,2,,,0,0,0,0,0,0,0,0,2,2,,116,,0,90000,,UM,3,2,,,,0,0,1
37,1,,38,46,0,0,0,0,0,0,0,0,1,1,3,116,0,0,170000,,UM,3,1,72,1.7,24.913494,0,4,1
38,1,2.7,28,41,1,276,0,0,0,0,0,0,1,2,1,116,1,0,160000,,UM,3,1,75,1.48,34.240322,0,2,1
39,0,3.0999999,42,46,0,0,0,0,0,0,0,1,2,1,2,116,0,0,180000,,M,2,2,90,1.8200001,27.17063,2,3,0
40,1,4,37,45,0,0,0,0,0,0,0,0,3,1,5,116,0,0,180000,,M,2,2,82,1.62,31.245237,4,1,0
41,0,,,,0,45,0,41,51,0,0,1,2,2,2,120,0,0,,,UM,3,1,,,,0,6,1
42,0,3,,,0,0,13,180,0,0,0,0,1,3,,120,,0,60000,,D,1,1,65,1.6900001,22.758305,0,2,1
43,0,2.4000001,30,43,0,0,0,224,0,0,0,0,1,2,,120,,0,140000,,UM,3,1,,,,0,1,1
44,0,2.5999999,35,46,0,0,0,0,0,0,0,1,2,1,,120,,0,300000,,UM,3,3,70,1.75,22.857143,0,4,1
45,0,3.0999999,36,45,0,0,0,0,0,0,0,1,1,3,4,120,0,0,180000,,M,2,2,71,1.8,21.913582,0,3,1
46,0,2.5,39,47,1,0,0,0,0,0,1,0,1,2,,120,,0,,,UM,3,2,,1.8,,0,1,1
47,1,2.4000001,,,,,,,,0,0,0,,,1,120,1,,,,,,1,58,1.62,22.10029,,2,
48,1,2.5,36,46,1,0,0,0,0,0,0,0,1,2,1,120,1,1,,20130327,UM,3,1,65,1.62,24.767567,0,2,1
49,0,2,37,48,0,59,185,245,185,0,0,0,1,2,1,120,1,0,,,UM,3,2,66,1.7,22.837368,0,1,1
50,0,2,41,48,0,0,0,0,0,0,0,0,2,3,,120,,0,70000,,M,2,2,,,,0,3,1
51,0,2.4000001,36,46,0,0,0,0,0,0,0,0,1,2,3,120,0,0,90000,,UM,3,2,75,1.76,24.212294,0,2,1
52,0,2.5,29,43,0,0,0,101,0,0,0,0,1,2,2,120,0,0,180000,,UM,3,3,78,1.73,26.061678,0,2,1
53,1,3.2,36,45,0,0,0,0,0,0,0,0,2,3,1,120,1,0,180000,,D,1,1,68,1.73,22.720438,4,5,0
54,1,1.9,31,45,0,0,0,0,0,0,0,0,1,2,1,120,1,0,200000,,UM,3,3,66,1.6,25.78125,2,4,0
55,0,2.3,42,46,0,154,0,0,190,0,0,0,2,1,,124,,0,,,M,2,2,70,1.8200001,21.132711,4,3,0
56,0,2.5,28,44,1,0,0,0,0,0,0,0,1,1,3,124,0,1,,20180124,D,1,1,91,1.83,27.1731,2,4,0
57,1,3.5,29,44,1,0,0,0,0,0,0,0,1,2,1,124,1,0,,,UM,3,1,54,1.62,20.576132,0,1,1
58,0,2.0999999,34,46,,,,,,1,0,1,,,2,124,0,0,,,,,1,81,1.78,25.564955,,3,
59,1,2,35,44,0,0,0,0,0,0,0,0,1,1,1,124,1,0,100000,,UM,3,1,52,1.5599999,21.367523,0,0,1
60,1,2.7,26,39,1,24,36,0,0,0,0,0,1,4,2,124,0,0,,,M,2,1,59,1.5700001,23.93606,4,1,0
61,1,1.9,,,1,0,0,0,0,0,0,0,1,2,1,124,1,0,,,UM,3,1,50,1.65,18.365473,0,1,1
62,0,2.3,,,0,0,0,0,0,0,0,0,2,2,3,124,0,0,180000,,UM,3,3,82,1.8099999,25.029762,0,2,1
63,1,2.0999999,,,0,0,0,0,0,0,0,0,1,2,1,124,1,0,80000,,UM,3,1,56,1.7,19.377161,0,1,1
64,1,4,41,48,0,0,0,0,0,0,0,0,2,1,4,124,0,0,80000,,M,2,1,60,1.6799999,21.258505,3,0,0
65,1,3.9000001,37,46,0,0,0,0,0,0,0,0,1,1,1,128,1,0,140000,,M,2,,,,,3,2,0
66,1,2.4000001,29,41,,108,,,,0,0,1,1,,3,128,0,1,130000,20131217,UM,3,2,61,1.5599999,25.065748,1,5,0
67,0,2.5999999,33,46,0,0,0,0,0,0,0,0,3,2,,128,,0,200000,,UM,3,2,,,,1,4,0
68,1,2.5,35,45,1,0,0,51,0,0,0,0,1,1,3,128,0,1,,20160915,D,1,1,65,1.73,21.718065,6,2,0
69,0,2.8,37,44,0,0,0,0,0,0,0,0,2,2,3,128,0,0,190000,,UM,3,2,77,1.84,22.743383,0,3,1
70,1,2.5,33,44,0,72,245,0,0,0,0,0,1,1,2,128,0,0,150000,,M,2,2,54,1.6900001,18.9069,1,4,0
71,1,2,,,1,0,0,0,0,0,0,0,1,1,2,128,0,0,,,D,1,1,45,1.62,17.146776,3,1,0
72,0,2.0999999,18,38,0,0,43,0,0,0,0,0,1,3,,128,,1,10000,20160417,D,1,2,,,,0,1,1
73,0,2.4000001,34,42,,,,,,0,0,1,,,4,128,0,,,,,,3,70,1.67,25.099503,,3,
74,1,2.5999999,27,42,0,0,0,0,318,0,0,1,1,2,1,128,1,0,180000,,UM,3,1,50,1.6,19.53125,2,5,0
75,1,3.0999999,39,46,0,0,0,0,0,1,1,0,2,3,1,128,1,0,180000,,M,2,1,62,1.72,20.957273,1,6,0
76,0,1.7,,,0,0,0,0,0,0,0,0,1,2,2,128,0,0,200000,,UM,3,3,77,1.78,24.302488,2,4,0
77,0,4,,,0,332,0,0,0,0,0,0,1,1,,128,,0,,,M,2,2,,,,5,4,0
78,1,2.8,40,48,0,0,0,0,0,0,0,0,3,3,1,128,0,0,160000,,M,2,1,67,1.7,23.18339,2,6,0
79,0,4,20,37,0,365,314,0,365,1,0,0,3,2,,132,,0,20000,,UM,3,2,,,,0,1,1
80,0,2.2,,,0,0,0,0,0,0,0,0,2,3,2,132,1,0,190000,,M,2,1,62,1.8200001,18.717545,0,3,1
81,0,1.6,22,41,,0,0,,,1,0,1,1,,,132,,1,130000,20111203,M,2,3,95,1.73,31.741789,0,0,1
82,0,3,40,47,0,0,0,0,0,0,0,0,2,2,,132,,0,180000,,UM,3,2,,,,0,0,1
83,0,4,32,44,0,365,0,0,0,0,0,0,1,3,,132,,0,190000,,M,2,2,,,,1,4,0
84,1,2.4000001,25,40,,,,,,1,0,1,2,,1,132,1,1,,20130402,UM,3,2,66,1.71,22.571047,,1,
85,0,2.2,40,47,1,0,0,0,0,0,0,0,2,1,,132,,0,210000,,M,2,2,90,1.8,27.777779,4,7,0
86,0,2.3,39,48,0,0,0,98,0,0,0,0,2,2,,132,,0,180000,,UM,3,1,,,,2,4,0
87,1,1.8,36,45,,,,,,0,0,0,,,2,132,1,,,,,,1,69,1.66,25.039919,,2,
88,0,2.5999999,34,44,1,0,0,0,0,0,0,1,2,1,,132,,0,80000,,M,2,1,60,1.6900001,21.007666,4,3,0
89,0,3,19,36,0,0,0,0,0,0,0,0,2,2,,136,,0,170000,,UM,3,3,68,1.5599999,27.942146,0,2,1
90,0,3,26,40,0,345,0,271,0,0,0,0,1,2,,136,,0,,,UM,3,2,65,1.75,21.224489,0,1,1
91,0,2.3,,,0,0,0,0,325,0,1,0,1,3,,136,,0,,,D,1,2,90,1.86,26.014568,0,1,1
92,0,2.2,36,43,0,0,220,0,0,0,0,0,2,2,,136,,1,220000,20170913,UM,3,3,70,1.8,21.604939,3,2,0
93,1,2.8,34,45,0,0,0,0,0,0,0,0,1,1,3,136,0,0,140000,,M,2,1,43,1.71,14.705379,1,2,0
94,1,1.4,36,47,0,0,0,0,0,0,0,0,2,2,2,136,0,0,120000,,UM,3,1,70,1.6799999,24.801588,4,1,0
95,0,2.5999999,,,0,0,0,0,0,0,0,0,1,1,,136,,0,180000,,UM,3,2,75,1.85,21.913805,0,3,1
96,0,3.4000001,27,42,0,0,0,0,0,0,0,0,2,2,,136,,0,180000,,UM,3,1,68,1.78,21.461937,0,1,1
97,1,3,31,42,,0,0,,,0,0,0,1,,2,136,0,0,70000,,UM,3,1,74,1.67,26.53376,0,1,1
98,1,2.9000001,37,46,0,225,157,365,2,1,0,0,1,1,3,136,0,0,60000,,M,2,2,75,1.6,29.296875,1,3,0
99,0,1.9,19,38,0,0,0,0,0,0,0,0,1,1,,136,,0,240000,,M,2,1,85,1.8,26.23457,0,0,1
100,0,2,36,45,0,0,0,0,0,0,0,0,1,3,,136,,0,270000,,UM,3,1,56,1.7,19.377161,1,1,0
101,1,2.4000001,,,0,0,0,0,0,0,0,0,1,1,2,136,0,0,140000,,M,2,1,50,1.6900001,17.506388,4,2,0
102,0,2.2,34,43,0,0,0,0,0,0,0,0,2,2,,136,,0,120000,,UM,3,3,,,,0,2,1
103,1,3.5,,,,,,,,0,0,0,,,1,136,1,1,,20141102,,,1,63,1.53,26.912727,,2,
104,0,2.5999999,38,48,0,0,0,0,0,0,0,0,2,1,2,136,0,0,200000,,M,2,2,77,1.85,22.498173,3,0,0
105,0,1.6,39,47,0,0,0,0,0,1,0,0,2,3,,136,,1,40000,20141013,UM,3,2,,,,2,3,0
106,1,2,,,1,0,0,0,0,0,0,0,2,2,1,136,1,0,160000,,UM,3,,,,,1,1,0
107,1,3,,,,,,,,0,1,0,,,1,136,1,,,,,,1,48,1.6,18.75,,5,
108,0,2.0999999,37,47,0,0,0,0,0,0,0,0,2,1,4,136,0,0,190000,,D,1,3,70,1.6799999,24.801588,1,1,0
109,1,1.8,45,47,0,0,53,334,0,0,0,0,1,3,1,136,1,0,140000,,M,2,1,69,1.7,23.875431,3,1,0
110,1,2.5,31,43,0,0,0,0,123,1,0,0,2,2,1,140,0,0,210000,,UM,3,2,48,1.72,16.224985,0,2,1
111,0,2.9000001,32,43,0,123,0,333,0,0,0,1,2,1,,140,,1,100000,20151008,M,2,1,,,,0,5,1
112,1,2.5999999,37,46,1,0,5,0,0,0,0,0,1,1,1,140,1,0,70000,,M,2,2,67,1.59,26.502115,3,2,0
113,0,2.8,,,0,0,0,0,0,0,0,0,1,1,,140,,0,190000,,M,2,3,115,1.89,32.193947,3,5,0
114,1,3.0999999,,,0,0,0,0,0,0,0,0,2,1,4,140,0,0,160000,,UM,3,1,57,1.66,20.68515,1,5,0
115,1,1.5,45,49,1,0,0,0,0,1,0,1,2,1,1,140,1,0,,,UM,3,2,61,1.63,22.959087,0,6,1
116,1,3.3,35,45,1,0,0,0,0,0,0,0,2,1,,140,,1,90000,20161027,M,2,1,,,,2,2,0
117,0,3.3,34,46,1,0,0,0,0,0,1,0,2,3,3,140,0,1,120000,20150429,M,2,2,65,1.75,21.224489,0,3,1
118,1,3.4000001,30,45,1,0,0,0,0,0,0,0,2,3,3,140,0,0,150000,,M,2,1,49,1.64,18.218323,0,10,1
119,1,3.7,45,48,,,,,,1,0,0,,,1,140,1,0,,,,,1,58,1.6900001,20.307411,,10,
120,0,3.0999999,39,47,0,0,43,0,0,0,0,0,2,1,3,144,0,0,220000,,D,1,1,85,1.75,27.755102,0,3,1
121,1,3.9000001,33,43,1,0,0,0,0,0,0,0,2,2,1,144,1,0,70000,,UM,3,1,50,1.5599999,20.545694,2,3,0
122,1,1.7,33,45,0,0,0,0,0,0,0,0,1,2,1,144,0,0,200000,,UM,3,1,72,1.62,27.434841,0,1,1
123,1,2.3,39,48,0,0,0,0,0,0,0,0,2,1,3,144,0,0,110000,,M,2,2,54,1.6799999,19.132654,2,0,0
124,1,2,,,1,0,0,0,0,0,0,0,2,3,2,144,0,0,,,M,2,2,67,1.64,24.910769,1,3,0
125,0,3,22,38,0,0,0,0,0,1,0,1,2,1,,144,,0,190000,,M,2,3,71,1.76,22.920971,1,4,0
126,0,2.3,22,39,0,0,0,0,101,0,0,1,1,3,,144,,0,200000,,D,1,2,,,,2,5,0
127,0,2.0999999,40,45,1,63,0,0,0,0,0,0,2,2,,144,,0,,,UM,3,3,,,,0,5,1
128,1,2.9000001,32,47,0,0,0,0,0,0,0,0,2,1,3,144,0,0,190000,,M,2,3,60,1.78,18.937004,1,1,0
129,1,2.3,,,1,2,0,0,0,1,0,0,1,1,1,144,0,0,100000,,UM,3,2,63,1.54,26.564346,0,2,1
130,0,2.9000001,37,48,1,200,31,0,0,0,1,1,,2,,144,,0,40000,,UM,3,2,67,1.83,20.006569,3,2,0
131,0,2.2,28,44,0,151,78,0,0,0,0,1,2,1,2,144,0,0,,,M,2,2,89,1.9400001,23.64757,1,1,0
132,0,1.5,37,47,1,0,0,26,0,0,0,0,2,1,2,144,0,1,120000,20180907,M,2,3,85,1.79,26.528511,2,3,0
133,1,2.7,39,46,0,18,0,0,0,0,0,0,2,1,1,144,1,0,310000,,M,2,2,53,1.65,19.467402,1,1,0
134,0,2,37,47,0,0,0,0,0,0,0,0,1,2,2,144,0,0,200000,,UM,3,2,80,1.8200001,24.15167,1,1,0
135,0,2.2,41,50,0,233,26,0,0,0,0,0,1,3,1,144,0,0,120000,,M,2,3,74,1.8,22.839508,4,0,0
136,0,1.8,29,45,1,0,0,0,0,1,0,1,2,2,3,144,0,0,190000,,UM,3,2,80,1.87,22.877405,0,3,1
137,1,2.5999999,37,48,0,0,0,0,0,0,0,0,2,1,3,144,0,0,,,M,2,3,57,1.7,19.723183,3,2,0
138,0,3,40,50,1,0,0,0,0,0,0,0,1,1,,144,,0,170000,,UM,3,2,105,1.96,27.332361,1,0,0
139,0,2.0999999,42,47,1,0,0,0,0,0,0,0,1,3,,148,,1,190000,20180730,M,2,2,75,1.89,20.996054,2,0,0
140,1,2,40,45,1,0,0,0,0,0,0,0,2,2,2,148,0,0,30000,,UM,3,1,57,1.65,20.93664,1,3,0
141,0,2.5,34,45,0,0,0,0,0,1,0,1,1,1,2,148,0,0,230000,,M,2,1,77,1.76,24.857954,1,6,0
142,0,,34,45,,,,,,0,1,0,,,1,148,1,0,,,,,3,90,1.87,25.737082,,4,
143,1,2.2,32,46,0,0,0,0,0,0,0,0,1,1,3,148,0,0,190000,,M,2,2,72,1.78,22.724403,3,2,0
144,0,2.3,,,0,0,0,0,0,0,0,0,1,3,,148,,0,170000,,D,1,2,68,1.78,21.461937,0,1,1
145,0,2.0999999,,,1,0,0,0,0,0,0,0,2,3,,148,,0,20000,,D,1,2,100,1.8,30.864199,0,6,1
146,1,2.0999999,41,44,0,0,0,0,0,0,0,0,2,2,1,148,1,0,170000,,UM,3,1,62,1.75,20.244898,0,2,1
147,0,2.0999999,39,46,0,0,0,0,0,0,0,0,1,1,,148,,0,180000,,M,2,1,80,1.8,24.691359,3,2,0
148,1,2.3,34,47,0,0,0,0,0,1,0,0,2,1,3,148,0,0,140000,,M,2,2,50,1.64,18.590126,5,2,0
149,0,2.2,36,47,0,218,0,0,0,0,0,0,1,1,,148,,0,,,M,2,2,,,,2,2,0
150,0,2,,,0,241,141,172,0,0,0,0,1,3,,148,,1,,20141218,D,1,2,63,1.77,20.109165,0,2,1
151,1,2.5999999,,,0,0,0,0,0,0,0,0,2,1,,148,,0,100000,,M,2,1,54,1.64,20.077335,1,2,0
152,0,1.4,41,48,0,0,0,0,0,1,0,0,1,2,1,148,1,0,180000,,UM,3,2,67,1.8200001,20.227024,0,3,1
153,0,3,35,47,0,0,16,33,0,0,0,0,1,3,4,148,0,0,170000,,M,2,2,62,1.78,19.568237,2,3,0
154,0,2.7,38,47,0,219,255,0,0,0,0,0,1,3,,148,,1,90000,20130623,D,1,2,80,1.85,23.374725,0,2,1
155,0,2.5999999,31,43,1,0,0,0,0,0,0,0,1,2,,148,,0,,,UM,3,2,100,1.74,33.029461,0,1,1
156,0,2,34,47,0,0,0,0,0,0,0,0,2,2,,148,,0,200000,,UM,3,3,75,1.83,22.395412,0,0,1
157,0,2.2,31,44,,,,,,0,0,0,,,1,148,0,,,,,,,75,1.97,19.325413,,1,
158,1,2.9000001,,,0,0,0,65,0,0,0,0,2,1,1,148,1,0,370000,,M,2,1,62,1.71,21.203104,4,6,0
159,0,2.8,36,46,0,0,0,0,0,0,0,0,3,1,1,148,0,0,390000,,M,2,1,85,1.83,25.381468,2,3,0
160,0,2.9000001,30,45,0,183,14,0,0,0,0,0,2,3,3,148,0,1,80000,20160925,UM,3,3,64,1.75,20.897959,0,2,1
161,0,1.6,,,0,0,0,,0,1,0,0,1,2,,152,,0,,,UM,3,2,,,,4,3,0
162,1,1.4,,,0,0,0,0,0,0,0,0,1,1,2,152,0,0,220000,,M,2,1,54,1.59,21.359913,1,3,0
163,1,2.5,39,46,0,0,0,0,0,0,0,0,2,2,3,152,0,0,130000,,UM,3,2,65,1.7,22.491348,1,1,0
164,1,2.9000001,34,46,0,0,0,0,0,0,0,0,1,1,1,152,1,0,190000,,M,2,1,60,1.67,21.513859,0,1,1
165,0,2,32,45,0,0,0,0,0,0,0,0,1,2,2,152,0,0,190000,,UM,3,2,75,1.77,23.939482,0,4,1
166,0,2.2,,,0,0,0,0,0,1,0,0,1,3,4,152,0,0,170000,,M,2,2,70,1.79,21.84701,1,0,0
167,0,2,,,0,164,127,241,0,0,0,0,2,1,1,152,1,0,,,M,2,3,85,1.89,23.795527,4,4,0
168,1,2.7,29,43,1,59,0,0,0,0,0,0,1,2,3,152,0,0,,,UM,3,1,70,1.6,27.34375,1,1,0
169,0,1.4,44,49,,,,,,1,0,0,,,1,152,0,,,,,,1,73,1.79,22.78331,,1,
170,0,2.4000001,39,46,,,,,,0,0,0,1,,1,152,1,0,,,M,2,1,80,1.8,24.691359,4,4,0
171,0,3.0999999,33,45,0,0,0,0,0,1,0,0,1,1,4,152,0,0,240000,,M,2,2,69,1.88,19.522408,0,5,1
172,1,1.8,32,45,0,0,0,49,0,0,0,0,2,3,2,152,0,0,150000,,D,1,2,54,1.73,18.0427,4,1,0
173,0,2.7,32,45,0,185,130,0,0,0,0,0,1,2,,152,,0,180000,,UM,3,1,70,1.6900001,24.508944,0,1,1
174,1,2.5,32,46,0,0,0,0,0,0,0,0,2,2,2,152,0,0,180000,,UM,3,3,60,1.59,23.733238,1,2,0
175,1,3.3,40,48,0,0,0,0,0,0,0,1,3,1,3,152,0,0,60000,,M,2,1,65,1.73,21.718065,4,6,0
176,0,2.9000001,30,43,0,0,0,0,0,0,0,0,1,2,3,152,0,0,260000,,UM,3,1,72,1.8,22.222223,3,1,0
177,0,2.8,34,43,1,0,0,0,0,0,0,0,2,2,3,152,0,0,100000,,UM,3,3,106,1.78,33.455372,0,1,1
178,0,2,17,35,0,0,0,0,0,1,0,0,2,2,,152,,0,130000,,UM,3,3,,,,0,2,1
179,0,2.7,,,0,0,183,108,157,0,0,1,2,3,4,152,0,1,160000,20130403,M,2,2,82,1.73,27.398174,1,1,0
180,0,3,,,0,0,0,0,0,0,0,0,1,1,,152,,0,210000,,M,2,2,,,,1,1,0
181,1,2.9000001,34,45,0,12,0,0,0,0,0,1,2,2,1,152,1,0,,,UM,3,1,57,1.6799999,20.19558,2,2,0
182,0,2.5999999,37,47,1,0,45,0,0,0,0,0,1,3,3,152,0,0,130000,,D,1,1,70,1.8099999,21.366871,0,1,1
183,1,3.0999999,,,0,0,0,0,0,1,0,0,2,1,4,152,0,0,150000,,M,2,2,56,1.71,19.151192,1,5,0
184,0,2.2,,,0,0,0,0,0,0,0,0,1,3,,152,,0,270000,,D,1,2,68,1.6900001,23.808689,1,4,0
185,1,2.5999999,22,40,0,0,0,0,0,0,0,1,2,2,2,152,1,0,160000,,UM,3,2,66,1.66,23.951227,1,4,0
186,1,1.6,32,43,1,0,0,0,0,0,0,0,2,3,1,152,0,0,160000,,M,2,3,68,1.61,26.233555,3,3,0
187,0,2.5,38,48,0,0,0,0,0,0,0,0,1,1,4,152,0,0,100000,,M,2,3,88,1.71,30.094728,3,3,0
188,1,2.8,,,0,85,54,0,0,0,0,0,3,2,2,156,0,0,90000,,UM,3,1,55,1.6,21.484375,0,3,1
189,0,2.5,36,46,0,0,0,74,0,0,0,0,2,2,3,156,0,0,610000,,UM,3,2,90,1.88,25.46401,0,4,1
190,1,2.7,37,48,0,0,0,0,0,0,0,0,2,2,2,156,0,0,130000,,UM,3,2,49,1.61,18.903591,4,1,0
191,1,3.0999999,24,43,,0,0,,,1,0,0,1,2,1,156,1,0,180000,,UM,3,1,75,1.76,24.212294,1,3,0
192,1,2.8,38,48,1,0,0,0,0,0,0,0,2,3,1,156,1,0,90000,,M,2,2,57,1.62,21.71925,3,4,0
193,0,1.9,34,46,0,0,0,0,0,1,0,0,1,1,3,156,1,0,200000,,M,2,2,66,1.84,19.494328,3,4,0
194,0,2.5,43,46,0,0,0,0,0,0,0,0,1,1,,156,,0,210000,,M,2,1,76,1.79,23.71961,3,2,0
195,1,2.4000001,32,43,0,0,0,0,0,0,0,0,2,2,4,156,0,0,150000,,UM,3,1,72,1.67,25.816631,0,2,1
196,1,3.2,18,38,,,,,,0,1,0,,,3,156,0,,,,,,1,50,1.64,18.590126,,3,
197,1,2,,,1,0,0,0,0,0,0,0,2,3,2,156,0,1,,20121223,D,1,1,53,1.6,20.703125,3,2,0
198,0,1.8,33,45,0,0,0,0,0,0,0,0,2,1,,156,,0,180000,,UM,3,2,67,1.71,22.913033,3,1,0
199,1,3,37,45,0,0,0,0,0,0,1,0,2,2,1,156,1,0,80000,,UM,3,1,41,1.72,13.858842,0,2,1
200,1,2.5,36,45,0,0,0,0,0,0,0,1,2,3,2,156,1,0,180000,,M,2,2,62,1.75,20.244898,2,2,0
201,0,2.7,35,46,0,0,158,110,0,0,0,0,2,1,1,156,0,0,30000,,M,2,3,82,1.8099999,25.029762,3,2,0
202,0,2,,,0,0,0,0,0,0,0,0,1,1,,156,,0,110000,,M,2,3,,,,4,5,0
203,1,2.8,38,47,0,0,0,0,0,0,0,0,3,3,1,156,1,0,180000,,D,1,1,58,1.71,19.835161,0,3,1
204,0,3,38,47,1,0,0,0,0,0,0,0,1,3,,156,,1,,20120708,UM,3,2,,,,0,1,1
205,1,2.3,35,45,,2,0,0,,0,1,1,2,3,,156,,0,10000,,UM,3,2,,,,1,1,0
206,1,2.2,36,48,0,0,0,0,0,1,0,0,2,2,3,156,0,0,180000,,UM,3,1,66,1.53,28.194284,0,2,1
207,0,1.6,36,44,0,0,0,0,0,0,0,0,1,1,2,156,0,0,170000,,M,2,3,75,1.77,23.939482,3,1,0
208,1,1.9,38,45,0,103,0,215,0,0,0,0,1,2,1,156,1,0,80000,,UM,3,2,80,1.64,29.7442,2,2,0
209,0,3,35,47,1,0,0,0,0,0,0,0,1,1,1,156,0,0,150000,,M,2,2,76,1.87,21.733536,1,2,0
210,0,,,,0,0,0,0,0,1,0,1,1,1,1,156,0,0,290000,,UM,3,2,82,1.77,26.173834,3,4,0
211,1,3.2,32,44,0,0,0,0,0,0,0,0,1,2,3,156,0,0,120000,,UM,3,1,60,1.65,22.038568,4,2,0
212,1,2.0999999,31,41,0,0,0,0,0,0,0,0,2,1,2,156,0,0,120000,,M,2,1,68,1.67,24.382374,2,4,0
213,1,2,33,45,0,0,0,0,0,0,0,0,3,2,1,156,0,0,170000,,UM,3,1,65,1.6900001,22.758305,0,2,1
214,0,1.3,38,45,0,0,29,0,25,0,0,0,2,3,2,156,0,0,190000,,D,1,2,84,1.79,26.216412,0,1,1
215,1,2.5999999,32,43,0,0,0,0,0,0,0,0,2,3,1,156,1,1,130000,20160318,M,2,1,53,1.7,18.3391,4,4,0
216,0,3.3,39,47,0,0,0,73,0,1,0,0,1,2,3,156,0,0,210000,,UM,3,1,80,1.8,24.691359,1,3,0
217,0,2,22,37,0,0,0,0,0,0,1,0,1,2,,156,,0,170000,,UM,3,2,75,1.7,25.951555,2,6,0
218,0,2,,,0,0,0,0,0,0,0,0,1,1,,156,,0,20000,,D,1,3,,,,3,4,0
219,0,2.8,31,45,0,0,0,0,0,0,0,0,1,1,,156,,0,170000,,M,2,2,80,1.8200001,24.15167,2,1,0
220,1,2.0999999,37,47,0,0,0,0,0,0,0,0,2,2,4,160,0,0,,,UM,3,1,68,1.67,24.382374,1,1,0
221,0,3.4000001,40,48,,,,,,0,0,1,,,1,160,1,,,,,,2,71,1.8,21.913582,,2,
222,0,2,32,45,0,0,0,0,0,0,0,0,1,3,3,160,0,0,180000,,M,2,2,60,1.65,22.038568,3,3,0
223,1,2,46,49,,214,,,,0,0,0,3,,1,160,1,0,120000,,M,2,2,68,1.73,22.720438,2,3,0
224,0,1.8,31,44,,,,,,1,0,0,1,,2,160,0,1,,20130930,UM,3,1,63,1.73,21.049818,,1,
225,1,2.7,36,48,0,0,0,0,0,0,0,0,2,2,1,160,1,0,130000,,UM,3,2,65,1.72,21.971334,2,1,0
226,1,3.5,30,44,0,0,0,0,0,0,0,1,2,1,4,160,0,0,160000,,M,2,1,49,1.6,19.140625,2,1,0
227,1,2.8,22,38,1,0,0,0,0,1,0,1,1,2,3,160,0,0,,,UM,3,1,50,1.46,23.456556,2,3,0
228,1,2.4000001,36,45,0,0,0,0,0,1,0,1,2,1,1,160,1,0,200000,,M,2,1,58,1.66,21.048048,3,1,0
229,1,1.8,36,45,1,0,0,0,0,0,0,0,1,3,2,160,0,0,130000,,M,2,3,55,1.59,21.755468,1,3,0
230,0,,38,48,,,,,,0,0,0,3,,,160,,1,,20111010,M,2,3,,,,,0,
231,0,2.4000001,38,47,0,0,0,0,0,0,0,1,2,1,3,160,0,0,230000,,M,2,2,84,1.75,27.428572,0,1,1
232,0,2.5,,,0,0,0,0,0,1,0,0,1,2,1,160,1,0,150000,,UM,3,,95,1.86,27.459822,0,1,1
233,0,2.8,32,46,0,0,0,0,0,0,1,0,1,2,,160,,0,140000,,UM,3,2,65,1.8,20.061729,0,3,1
234,1,2.4000001,,,0,0,50,0,0,0,0,0,2,2,2,160,0,0,90000,,UM,3,1,63,1.58,25.23634,0,2,1
235,0,2.9000001,45,49,0,0,0,0,0,0,0,0,2,1,3,160,0,0,200000,,M,2,2,76,1.6799999,26.927439,0,3,1
236,1,2.8,,,0,0,0,0,0,1,1,0,1,3,4,160,0,0,310000,,M,2,1,60,1.67,21.513859,1,4,0
237,0,2.5,36,45,0,0,0,0,0,0,0,0,2,1,2,160,0,0,,,M,2,2,100,1.85,29.218407,4,0,0
238,0,2.7,,,0,0,0,0,0,0,0,0,2,2,2,160,0,0,180000,,UM,3,1,97,1.9299999,26.04097,0,1,1
239,1,2,35,48,0,0,0,0,0,1,0,1,2,1,2,160,0,0,140000,,M,2,2,70,1.6,27.34375,3,4,0
240,0,1.6,31,44,1,0,0,0,0,0,0,0,1,2,,160,,0,,,UM,3,1,,,,0,1,1
241,0,2.7,36,45,0,0,0,0,0,0,0,0,2,2,3,160,0,1,30000,20201221,UM,3,2,85,1.79,26.528511,5,1,0
242,1,2.0999999,39,46,1,0,0,0,144,0,0,0,3,3,1,160,1,0,100000,,M,2,2,55,1.7,19.031141,3,2,0
243,0,3,44,48,0,0,0,0,0,0,0,0,1,1,2,160,0,0,170000,,M,2,2,80,1.86,23.12406,2,2,0
244,1,2.8,28,45,0,0,0,0,0,0,0,0,3,1,2,160,0,0,190000,,M,2,1,60,1.6900001,21.007666,3,3,0
245,1,1.7,42,47,0,0,0,0,0,0,0,0,2,1,1,160,0,0,140000,,M,2,1,70,1.6,27.34375,3,2,0
246,0,2.2,,,,,,,,0,0,0,,,,160,,,,,,,2,78,1.8200001,23.54788,,4,
247,1,2.7,37,47,0,0,0,0,0,0,0,0,1,1,3,160,0,0,,,UM,3,2,68,1.75,22.204082,1,2,0
248,1,2,35,45,0,0,0,0,0,0,0,1,2,3,2,160,0,0,140000,,D,1,1,44,1.73,14.70146,0,1,1
249,1,2.3,,,0,0,0,0,0,1,0,1,1,2,1,160,1,0,250000,,UM,3,1,59,1.8099999,18.00922,0,5,1
250,0,2.5999999,27,44,1,0,0,0,0,0,0,0,2,1,,164,,0,170000,,M,2,2,,,,5,1,0
251,1,3.3,42,48,1,0,0,0,0,0,0,0,2,2,3,164,1,0,70000,,UM,3,2,56,1.7,19.377161,0,5,1
252,0,3.2,,,0,0,0,0,0,0,0,0,1,1,3,164,0,0,210000,,M,2,2,79,1.6900001,27.660093,3,3,0
253,1,2.3,36,48,0,0,0,0,0,0,0,0,1,1,2,164,0,0,,,M,2,1,72,1.6,28.125,2,0,0
254,0,2.5999999,27,42,0,205,117,0,281,0,1,0,2,3,,164,,0,,,UM,3,3,,,,1,1,0
255,1,1.6,33,44,0,196,0,0,0,0,0,0,2,1,2,164,0,0,130000,,M,2,1,52,1.53,22.21368,2,0,0
256,0,2.3,48,50,,,,,,0,0,0,,,,164,,0,,,,,3,70,1.8,21.604939,,2,
257,1,2.2,,,0,0,0,0,87,0,0,0,1,1,3,164,0,0,170000,,M,2,1,90,1.6900001,31.511499,1,3,0
258,1,3.0999999,32,41,0,0,0,0,0,1,0,0,2,1,3,164,0,0,170000,,M,2,1,72,1.72,24.337479,2,3,0
259,1,2,26,44,0,0,0,0,0,0,0,0,1,1,3,164,0,0,180000,,M,2,1,63,1.6799999,22.32143,6,4,0
260,0,3.2,,,0,0,0,0,0,0,0,0,3,2,4,164,0,0,280000,,UM,3,3,75,1.86,21.678806,0,2,1
261,1,2.4000001,33,44,0,8,0,0,0,0,0,1,2,1,3,164,0,0,130000,,M,2,3,55,1.7,19.031141,2,4,0
262,0,2.5,,,1,0,0,0,0,0,0,0,2,2,3,164,0,0,,,UM,3,2,80,1.78,25.249338,0,1,1
263,1,2.0999999,42,47,0,0,0,0,0,0,0,0,1,2,1,164,1,0,140000,,UM,3,1,66,1.72,22.309355,1,1,0
264,1,2,36,43,0,0,,180,4,0,0,0,2,,1,164,1,0,10000,,D,1,1,68,1.67,24.382374,2,1,0
265,1,4.5,31,46,0,0,0,0,0,1,1,0,2,1,1,164,1,0,150000,,M,2,1,78,1.7,26.989618,0,2,1
266,0,2.3,32,42,,0,0,0,,0,0,0,2,3,,164,,0,120000,,M,2,1,60,1.7,20.761244,3,0,0
267,1,2.0999999,,,1,0,0,0,0,1,0,0,1,1,1,164,1,0,,,M,2,2,73,1.78,23.04002,1,2,0
268,0,2.7,39,49,1,0,0,0,0,0,0,0,2,3,1,164,1,0,220000,,D,1,1,79,1.83,23.589834,0,2,1
269,0,1.5,32,43,0,0,0,0,0,0,0,0,1,1,,164,,0,220000,,M,2,2,75,1.8,23.148149,1,1,0
270,0,1.7,51,50,0,0,0,0,0,0,0,0,1,1,2,164,0,0,120000,,D,1,3,100,1.9,27.700832,0,1,1
271,1,1.6,,,0,0,0,0,0,0,0,0,2,1,2,164,0,0,70000,,M,2,1,73,1.72,24.675499,0,5,1
272,0,2.5,,,1,0,0,0,0,0,0,0,2,2,,164,,0,,,UM,3,2,,,,1,1,0
273,0,3.0999999,,,0,,56,0,0,0,0,0,,2,1,164,0,0,,,UM,3,3,74,1.78,23.355639,0,5,1
274,0,2.7,33,43,,,,,,0,0,0,,,,164,,0,,,,,2,,,,,5,
275,1,,,,1,0,0,0,0,0,0,0,3,2,3,164,0,0,10000,,UM,3,3,,1.6,,0,0,1
276,1,2,,,0,78,0,0,0,0,1,0,2,1,1,164,0,0,,,M,2,1,55,1.7,19.031141,1,2,0
277,0,2.2,,,1,34,176,37,0,0,0,1,2,2,,164,,0,,,UM,3,2,60,1.75,19.591837,0,0,1
278,1,2.5999999,27,43,0,0,0,0,0,0,0,0,2,3,3,164,0,0,130000,,M,2,1,70,1.72,23.661438,2,4,0
279,0,1.8,37,45,0,0,0,0,0,0,0,0,3,1,2,164,0,0,230000,,M,2,1,90,1.86,26.014568,2,1,0
280,1,2.4000001,28,42,1,0,0,0,0,1,0,0,1,2,1,164,1,0,160000,,UM,3,1,68,1.67,24.382374,0,2,1
281,1,3.5999999,34,43,0,0,0,0,0,1,0,0,2,2,4,164,0,0,150000,,UM,3,1,70,1.64,26.026175,3,4,0
282,1,1.9,27,43,1,0,0,0,0,0,0,1,1,3,1,164,1,0,20000,,M,2,2,49,1.71,16.757292,5,3,0
283,1,3,30,44,1,50,0,191,0,0,0,0,2,4,3,164,0,0,100000,,W,4,1,75,1.6799999,26.573132,2,1,0
284,1,2.4000001,43,46,0,0,0,0,0,0,0,0,2,1,1,164,1,0,150000,,M,2,3,55,1.64,20.449139,2,1,0
285,0,3.2,,,0,0,0,0,0,0,0,0,2,1,,164,,0,250000,,M,2,2,,,,3,2,0
286,1,2.5,36,47,0,0,0,0,0,0,0,1,1,2,1,164,1,0,150000,,UM,3,2,43,1.5599999,17.669298,1,2,0
287,1,3.3,34,48,0,0,0,0,0,1,0,0,1,1,4,164,0,0,180000,,UM,3,2,57,1.63,21.453573,0,3,1
288,0,2.7,42,49,,,,,,0,0,0,,,2,164,0,0,,,,,2,92,1.8099999,28.082172,,1,
289,0,1.9,,,0,0,9,0,0,0,0,0,1,1,,164,,0,140000,,M,2,2,,,,4,2,0
290,1,2.3,38,49,0,0,5,0,0,0,0,0,1,3,1,164,0,0,,,M,2,1,51,1.66,18.507767,2,3,0
291,0,3.4000001,,,0,0,0,0,0,0,0,0,2,1,,164,,0,270000,,M,2,3,68,1.85,19.868517,3,3,0